running 1 test test os_core_tools_directory_disk_positive ... FAILED failures: ---- os_core_tools_directory_disk_positive stdout ---- thread 'os_core_tools_directory_disk_positive' (48301454) panicked at tests/core_tools.rs:377:5: assertion `left == right` failed left: ["INNER", "HIDDEN"] right: ["INNER"] note: run with `RUST_BACKTRACE=1` environment variable to display a backtrace failures: os_core_tools_directory_disk_positive test result: FAILED. 0 passed; 1 failed; 0 ignored; 0 measured; 9 filtered out; finished in 0.00s Compiling turkos-userspace v0.1.0 (/reports/os-implementation/K1295-ls-local-preflight-CNhIy6/workspace/userspace) Finished `test` profile [unoptimized + debuginfo] target(s) in 0.15s Running tests/core_tools.rs (reports/os-implementation/K1295-ls-local-preflight-CNhIy6/target/debug/build/turkos-userspace/30ac75017d891047/out/core_tools-30ac75017d891047) error: test failed, to rerun pass `--test core_tools`