running 1 test test spaces::tests::id_generation_exhaustion_retires_before_acquisition_and_uses_next_slot ... FAILED failures: ---- spaces::tests::id_generation_exhaustion_retires_before_acquisition_and_uses_next_slot stdout ---- thread 'spaces::tests::id_generation_exhaustion_retires_before_acquisition_and_uses_next_slot' (41109352) panicked at src/spaces.rs:429:35: called `Result::unwrap()` on an `Err` value: Generation note: run with `RUST_BACKTRACE=1` environment variable to display a backtrace failures: spaces::tests::id_generation_exhaustion_retires_before_acquisition_and_uses_next_slot test result: FAILED. 0 passed; 1 failed; 0 ignored; 0 measured; 2 filtered out; finished in 0.00s Compiling turkos-os-address-spaces v0.1.0 (/reports/os-implementation/K821-K839-preparation-6JTwAT/mutant-unretired-overflow-id/os-address-spaces) Finished `test` profile [unoptimized + debuginfo] target(s) in 0.20s Running unittests src/lib.rs (reports/os-implementation/K821-K839-preparation-6JTwAT/mutant-unretired-overflow-id/target/debug/build/turkos-os-address-spaces/cfd5049215abc616/out/turkos_os_address_spaces-cfd5049215abc616) error: test failed, to rerun pass `--lib`