running 1 test test metadata_enospc_checks_before_acquisition ... FAILED failures: ---- metadata_enospc_checks_before_acquisition stdout ---- thread 'metadata_enospc_checks_before_acquisition' (40964331) panicked at tests/heap.rs:225:5: assertion `left == right` failed left: 3 right: 2 note: run with `RUST_BACKTRACE=1` environment variable to display a backtrace failures: metadata_enospc_checks_before_acquisition test result: FAILED. 0 passed; 1 failed; 0 ignored; 0 measured; 12 filtered out; finished in 0.00s Compiling turkos-os-kernel-heap v0.1.0 (/reports/os-implementation/K761-K779-preparation-KNIrm3/mutant-early-acquire/os-kernel-heap) Finished `test` profile [unoptimized + debuginfo] target(s) in 0.30s Running tests/heap.rs (reports/os-implementation/K761-K779-preparation-KNIrm3/mutant-early-acquire/target/debug/build/turkos-os-kernel-heap/04dbad547e5317ad/out/heap-04dbad547e5317ad) error: test failed, to rerun pass `--test heap`