running 1 test test mutex_prepare_park_failure_publishes_no_owner_or_waiter ... FAILED failures: failures: mutex_prepare_park_failure_publishes_no_owner_or_waiter test result: FAILED. 0 passed; 1 failed; 0 ignored; 0 measured; 33 filtered out; finished in 0.00s Compiling turkos-os-locking v0.1.0 (/reports/os-implementation/K961-K979-preparation-HHDGYT/mutant-mutex-park-prefix-published/os-locking) Finished `test` profile [unoptimized + debuginfo] target(s) in 0.46s Running tests/locking.rs (reports/os-implementation/K961-K979-preparation-HHDGYT/mutant-mutex-park-prefix-published/target/debug/build/turkos-os-locking/36db3b80b1dba7b1/out/locking-36db3b80b1dba7b1) thread 'mutex_prepare_park_failure_publishes_no_owner_or_waiter' (41477166) panicked at tests/locking.rs:619:5: assertion failed: lock.records().iter().all(Option::is_none) note: run with `RUST_BACKTRACE=1` environment variable to display a backtrace error: test failed, to rerun pass `--test locking`