running 1 test test os_handles_close_negative ... FAILED failures: failures: os_handles_close_negative test result: FAILED. 0 passed; 1 failed; 0 ignored; 0 measured; 2 filtered out; finished in 0.00s thread 'os_handles_close_negative' (48475186) panicked at /reports/os-implementation/K1320-handles-lifetime-local-preflight-jfT5st/workspace/kernel/tests/os/handles_lifetime.rs:55:5: assertion `left == right` failed left: Some((Channel(52), 0, false)) right: Some((Channel(52), 0, true)) note: run with `RUST_BACKTRACE=1` environment variable to display a backtrace