running 1 test test os_core_tools_read_file_positive ... FAILED failures: ---- os_core_tools_read_file_positive stdout ---- thread 'os_core_tools_read_file_positive' (48241713) panicked at tests/core_tools.rs:97:9: assertion `left == right` failed left: 0 right: 1 note: run with `RUST_BACKTRACE=1` environment variable to display a backtrace failures: os_core_tools_read_file_positive test result: FAILED. 0 passed; 1 failed; 0 ignored; 0 measured; 3 filtered out; finished in 0.00s Compiling turkos-userspace v0.1.0 (/reports/os-implementation/K1290-cat-local-preflight-vUFyhq/workspace/userspace) Finished `test` profile [unoptimized + debuginfo] target(s) in 0.14s Running tests/core_tools.rs (reports/os-implementation/K1290-cat-local-preflight-vUFyhq/target/debug/build/turkos-userspace/2f3df33cdaeef951/out/core_tools-2f3df33cdaeef951) error: test failed, to rerun pass `--test core_tools`