running 1 test test exceptions::tests::ingress_generation_exhaustion_changes_no_entry_or_counter ... FAILED failures: ---- exceptions::tests::ingress_generation_exhaustion_changes_no_entry_or_counter stdout ---- thread 'exceptions::tests::ingress_generation_exhaustion_changes_no_entry_or_counter' (41254415) panicked at src/exceptions.rs:583:9: assertion `left == right` failed left: Ok(EntryToken { controller: 920, generation: 0, depth: 1, frame: 1073806496, slot: 8, live: true }) right: Err(Generation) note: run with `RUST_BACKTRACE=1` environment variable to display a backtrace failures: exceptions::tests::ingress_generation_exhaustion_changes_no_entry_or_counter test result: FAILED. 0 passed; 1 failed; 0 ignored; 0 measured; 2 filtered out; finished in 0.00s Compiling turkos-os-exceptions v0.1.0 (/reports/os-implementation/K901-K919-preparation-EQ5mcc/mutant-wrapping-ingress/os-exceptions) Finished `test` profile [unoptimized + debuginfo] target(s) in 0.17s Running unittests src/lib.rs (reports/os-implementation/K901-K919-preparation-EQ5mcc/mutant-wrapping-ingress/target/debug/build/turkos-os-exceptions/fc00ebc01b1d547f/out/turkos_os_exceptions-fc00ebc01b1d547f) error: test failed, to rerun pass `--lib`