running 1 test test duplicate_owner_ids_still_cannot_cross_workspace_tokens ... FAILED failures: failures: duplicate_owner_ids_still_cannot_cross_workspace_tokens test result: FAILED. 0 passed; 1 failed; 0 ignored; 0 measured; 17 filtered out; finished in 0.00s Blocking waiting for file lock on package cache Compiling turkos-os-runtime-platform v0.1.0 (/os-runtime-platform) Compiling turkos-os-frame-authority v0.1.0 (/os-frame-authority) Compiling turkos-os-buddy-frames v0.1.0 (/reports/os-implementation/K741-K759-7jBhgr/mutant-cross-workspace-token/os-buddy-frames) warning: field `workspace` is never read --> src/buddy.rs:99:5 | 96 | pub struct BlockLease { | ---------- field in this struct ... 99 | workspace: u64, | ^^^^^^^^^ | = note: `BlockLease` has a derived impl for the trait `Debug`, but this is intentionally ignored during dead code analysis = note: `#[warn(dead_code)]` (part of `#[warn(unused)]`) on by default warning: `turkos-os-buddy-frames` (lib) generated 1 warning Finished `test` profile [unoptimized + debuginfo] target(s) in 0.50s Running tests/buddy.rs (reports/os-implementation/K741-K759-7jBhgr/mutant-cross-workspace-token/target/debug/build/turkos-os-buddy-frames/aed4ac960f5fbb7a/out/buddy-aed4ac960f5fbb7a) thread 'duplicate_owner_ids_still_cannot_cross_workspace_tokens' (41025194) panicked at tests/buddy.rs:349:54: called `Result::unwrap_err()` on an `Ok` value: () note: run with `RUST_BACKTRACE=1` environment variable to display a backtrace error: test failed, to rerun pass `--test buddy`