running 2 tests test os_pci_msix_positive ... ok test os_pci_msix_negative ... FAILED failures: ---- os_pci_msix_negative stdout ---- thread 'os_pci_msix_negative' (49221020) panicked at /reports/os-implementation/K1460-pci-msix-local-YBKG86/mutant/kernel/tests/os/pci_msix.rs:31:5: assertion `left == right` failed left: Ok(()) right: Err(InvalidMessage) note: run with `RUST_BACKTRACE=1` environment variable to display a backtrace failures: os_pci_msix_negative test result: FAILED. 1 passed; 1 failed; 0 ignored; 0 measured; 0 filtered out; finished in 0.00s