running 1 test test os_runqueue_quantum_negative ... FAILED failures: failures: os_runqueue_quantum_negative test result: FAILED. 0 passed; 1 failed; 0 ignored; 0 measured; 21 filtered out; finished in 0.00s Compiling turkos-os-exceptions v0.1.0 (/reports/os-implementation/K1041-K1059-preparation-5hOulI/mutant-same-tick-replay/os-exceptions) Compiling turkos-os-threads v0.1.0 (/reports/os-implementation/K1041-K1059-preparation-5hOulI/mutant-same-tick-replay/os-threads) Compiling turkos-os-context-switch v0.1.0 (/reports/os-implementation/K1041-K1059-preparation-5hOulI/mutant-same-tick-replay/os-context-switch) Compiling turkos-os-runqueue v0.1.0 (/reports/os-implementation/K1041-K1059-preparation-5hOulI/mutant-same-tick-replay/os-runqueue) Finished `test` profile [unoptimized + debuginfo] target(s) in 0.63s Running tests/runqueue.rs (reports/os-implementation/K1041-K1059-preparation-5hOulI/mutant-same-tick-replay/target/debug/build/turkos-os-runqueue/abbba3c1dbbd7138/out/runqueue-abbba3c1dbbd7138) thread 'os_runqueue_quantum_negative' (41916847) panicked at tests/runqueue.rs:114:14: explicit panic note: run with `RUST_BACKTRACE=1` environment variable to display a backtrace error: test failed, to rerun pass `--test runqueue`