running 2 tests test os_vfs_tmpfs_positive ... ok test os_vfs_tmpfs_negative ... FAILED failures: ---- os_vfs_tmpfs_negative stdout ---- thread 'os_vfs_tmpfs_negative' (50111839) panicked at /reports/os-implementation/K1590-vfs-tmpfs-local-jAwCnK/mutant/kernel/tests/os/vfs_tmpfs.rs:48:5: assertion `left == right` failed left: Ok(7) right: Err(InvalidOwner) note: run with `RUST_BACKTRACE=1` environment variable to display a backtrace failures: os_vfs_tmpfs_negative test result: FAILED. 1 passed; 1 failed; 0 ignored; 0 measured; 0 filtered out; finished in 0.00s