running 1 test test same_ids_in_different_workspaces_cannot_unpin_another_scope ... FAILED failures: ---- same_ids_in_different_workspaces_cannot_unpin_another_scope stdout ---- thread 'same_ids_in_different_workspaces_cannot_unpin_another_scope' (41039978) panicked at tests/dma.rs:232:41: called `Result::unwrap_err()` on an `Ok` value: () note: run with `RUST_BACKTRACE=1` environment variable to display a backtrace failures: same_ids_in_different_workspaces_cannot_unpin_another_scope test result: FAILED. 0 passed; 1 failed; 0 ignored; 0 measured; 20 filtered out; finished in 0.00s Compiling turkos-os-frame-metadata v0.1.0 (/os-frame-metadata) Compiling turkos-os-dma-memory v0.1.0 (/reports/os-implementation/K781-K799-preparation-zLhH8b/mutant-workspace-alias/os-dma-memory) warning: field `workspace` is never read --> src/dma.rs:210:5 | 208 | pub struct Ticket { | ------ field in this struct 209 | scope: u64, 210 | workspace: u64, | ^^^^^^^^^ | = note: `Ticket` has a derived impl for the trait `Debug`, but this is intentionally ignored during dead code analysis = note: `#[warn(dead_code)]` (part of `#[warn(unused)]`) on by default warning: `turkos-os-dma-memory` (lib) generated 1 warning Finished `test` profile [unoptimized + debuginfo] target(s) in 0.34s Running tests/dma.rs (reports/os-implementation/K781-K799-preparation-zLhH8b/mutant-workspace-alias/target/debug/build/turkos-os-dma-memory/085ed0d7ca9a8439/out/dma-085ed0d7ca9a8439) error: test failed, to rerun pass `--test dma`