running 1 test test post_switch_uncertainty_retains_real_context_and_all_member_authority ... FAILED failures: failures: post_switch_uncertainty_retains_real_context_and_all_member_authority test result: FAILED. 0 passed; 1 failed; 0 ignored; 0 measured; 21 filtered out; finished in 0.00s Compiling turkos-os-threads v0.1.0 (/reports/os-implementation/K1041-K1059-preparation-5hOulI/mutant-unowned-prepared-dropped/os-threads) Compiling turkos-os-exceptions v0.1.0 (/reports/os-implementation/K1041-K1059-preparation-5hOulI/mutant-unowned-prepared-dropped/os-exceptions) Compiling turkos-os-context-switch v0.1.0 (/reports/os-implementation/K1041-K1059-preparation-5hOulI/mutant-unowned-prepared-dropped/os-context-switch) Compiling turkos-os-runqueue v0.1.0 (/reports/os-implementation/K1041-K1059-preparation-5hOulI/mutant-unowned-prepared-dropped/os-runqueue) Finished `test` profile [unoptimized + debuginfo] target(s) in 0.58s Running tests/runqueue.rs (reports/os-implementation/K1041-K1059-preparation-5hOulI/mutant-unowned-prepared-dropped/target/debug/build/turkos-os-runqueue/3755cddfd574ffaf/out/runqueue-3755cddfd574ffaf) thread 'post_switch_uncertainty_retains_real_context_and_all_member_authority' (41918494) panicked at tests/runqueue.rs:180:5: assertion failed: q.snapshot().faulted && q.snapshot().retained_prepared note: run with `RUST_BACKTRACE=1` environment variable to display a backtrace error: test failed, to rerun pass `--test runqueue`