running 2 tests test os_turkfs_namespace_links_positive ... ok test os_turkfs_namespace_links_negative ... FAILED failures: ---- os_turkfs_namespace_links_negative stdout ---- thread 'os_turkfs_namespace_links_negative' (50505767) panicked at /reports/os-implementation/K1660-turkfs-links-local-zPVY90/mutant/kernel/tests/os/turkfs_namespace_links.rs:31:5: assertion `left == right` failed left: Err(Quota) right: Err(DirectoryLink) note: run with `RUST_BACKTRACE=1` environment variable to display a backtrace failures: os_turkfs_namespace_links_negative test result: FAILED. 1 passed; 1 failed; 0 ignored; 0 measured; 0 filtered out; finished in 0.00s