running 2 tests test os_turkfs_journal_checkpoint_positive ... ok test os_turkfs_journal_checkpoint_negative ... FAILED failures: ---- os_turkfs_journal_checkpoint_negative stdout ---- thread 'os_turkfs_journal_checkpoint_negative' (50566144) panicked at /reports/os-implementation/K1680-turkfs-checkpoint-local-ckBZqw/mutant/kernel/tests/os/turkfs_journal_checkpoint.rs:59:5: assertion `left == right` failed left: Ok(()) right: Err(Order) note: run with `RUST_BACKTRACE=1` environment variable to display a backtrace failures: os_turkfs_journal_checkpoint_negative test result: FAILED. 1 passed; 1 failed; 0 ignored; 0 measured; 0 filtered out; finished in 0.00s