running 1 test test actual_canary_corruption_blocks_selection_exit_and_release_with_resources_retained ... FAILED failures: failures: actual_canary_corruption_blocks_selection_exit_and_release_with_resources_retained test result: FAILED. 0 passed; 1 failed; 0 ignored; 0 measured; 21 filtered out; finished in 0.00s Compiling turkos-os-threads v0.1.0 (/reports/os-implementation/K1001-K1019-preparation-Vy7GRN/mutant-canaries-ignored/os-threads) Finished `test` profile [unoptimized + debuginfo] target(s) in 0.28s Running tests/threads.rs (reports/os-implementation/K1001-K1019-preparation-Vy7GRN/mutant-canaries-ignored/target/debug/build/turkos-os-threads/fc0d96e38d2f6d6f/out/threads-fc0d96e38d2f6d6f) thread 'actual_canary_corruption_blocks_selection_exit_and_release_with_resources_retained' (41559469) panicked at tests/threads.rs:489:5: assertion `left == right` failed left: Ok(ReadyContext { id: ThreadId { table: 1, slot: 0, generation: 1 }, entry: 1074266176, argument: 0, initial_sp: 2147504112 }) right: Err(Canary) note: run with `RUST_BACKTRACE=1` environment variable to display a backtrace error: test failed, to rerun pass `--test threads`