running 1 test test os_shell_input_cancel_invalidates_stale_commit_and_allows_new_line ... FAILED failures: ---- os_shell_input_cancel_invalidates_stale_commit_and_allows_new_line stdout ---- thread 'os_shell_input_cancel_invalidates_stale_commit_and_allows_new_line' (48188034) panicked at tests/input.rs:11:5: assertion `left == right` failed left: None right: Some(StaleEpoch) note: run with `RUST_BACKTRACE=1` environment variable to display a backtrace failures: os_shell_input_cancel_invalidates_stale_commit_and_allows_new_line test result: FAILED. 0 passed; 1 failed; 0 ignored; 0 measured; 2 filtered out; finished in 0.00s Compiling turkos-os-shell-input v0.1.0 (/reports/os-implementation/K1280-input-local-preflight-CsDJIq/workspace/os-shell-input) warning: unused variable: `next` --> src/lib.rs:51:13 | 51 | let next = self.epoch.0.checked_add(1).ok_or(Error::EpochOverflow)?; | ^^^^ help: if this is intentional, prefix it with an underscore: `_next` | = note: `#[warn(unused_variables)]` (part of `#[warn(unused)]`) on by default warning: `turkos-os-shell-input` (lib) generated 1 warning (run `cargo fix --lib -p turkos-os-shell-input` to apply 1 suggestion) Finished `test` profile [unoptimized + debuginfo] target(s) in 0.12s Running tests/input.rs (reports/os-implementation/K1280-input-local-preflight-CsDJIq/target/debug/build/turkos-os-shell-input/a0349d5e2e8bbdfc/out/input-a0349d5e2e8bbdfc) error: test failed, to rerun pass `--test input`