running 1 test test active_root_release_retains_identical_owner_token ... FAILED failures: ---- active_root_release_retains_identical_owner_token stdout ---- thread 'active_root_release_retains_identical_owner_token' (41109186) panicked at tests/spaces.rs:297:5: assertion `left == right` failed left: Err(Stale) right: Ok(Observation { owner: 11, slot: 0, generation: 1, root: 1073745920, asid: 1, asid_generation: 1 }) note: run with `RUST_BACKTRACE=1` environment variable to display a backtrace failures: active_root_release_retains_identical_owner_token test result: FAILED. 0 passed; 1 failed; 0 ignored; 0 measured; 17 filtered out; finished in 0.00s Compiling turkos-os-address-spaces v0.1.0 (/reports/os-implementation/K821-K839-preparation-6JTwAT/mutant-lost-retained-root/os-address-spaces) warning: unused variable: `owner` --> src/spaces.rs:330:13 | 330 | owner, | ^^^^^ help: try ignoring the field: `owner: _` | = note: `#[warn(unused_variables)]` (part of `#[warn(unused)]`) on by default warning: unused variable: `generation` --> src/spaces.rs:331:13 | 331 | generation, | ^^^^^^^^^^ help: try ignoring the field: `generation: _` warning: `turkos-os-address-spaces` (lib) generated 2 warnings (run `cargo fix --lib -p turkos-os-address-spaces` to apply 2 suggestions) Finished `test` profile [unoptimized + debuginfo] target(s) in 0.30s Running tests/spaces.rs (reports/os-implementation/K821-K839-preparation-6JTwAT/mutant-lost-retained-root/target/debug/build/turkos-os-address-spaces/8a8b018c19f35bf8/out/spaces-8a8b018c19f35bf8) error: test failed, to rerun pass `--test spaces`