running 1 test test nonzero_bss_rejected ... FAILED failures: failures: nonzero_bss_rejected test result: FAILED. 0 passed; 1 failed; 0 ignored; 0 measured; 8 filtered out; finished in 0.00s Compiling turkos-os-entry-sections v0.1.0 (/reports/os-implementation/K626-K629-XLzoBa/mutant-ignore-bss-content/os-entry-sections) Finished `test` profile [unoptimized + debuginfo] target(s) in 0.19s Running tests/sections.rs (reports/os-implementation/K626-K629-XLzoBa/mutant-ignore-bss-content/target/debug/build/turkos-os-entry-sections/8b855fd6dab4304a/out/sections-8b855fd6dab4304a) thread 'nonzero_bss_rejected' (40739142) panicked at tests/sections.rs:67:5: assertion `left == right` failed left: Ok(()) right: Err(BssNotZero) note: run with `RUST_BACKTRACE=1` environment variable to display a backtrace error: test failed, to rerun pass `--test sections`