running 1 test test success_without_returning_resources_is_rejected ... FAILED failures: failures: success_without_returning_resources_is_rejected test result: FAILED. 0 passed; 1 failed; 0 ignored; 0 measured; 19 filtered out; finished in 0.00s Compiling typenum v1.20.1 Compiling libc v0.2.190 Compiling cfg-if v1.0.5 Compiling turkos-bootinfo v0.0.1 (/bootinfo) Compiling turkos-os-runtime-services v0.1.0 (/reports/os-implementation/K641-K659-5qb6G5/mutant-missing-return/os-runtime-services) Compiling hybrid-array v0.4.15 Compiling crypto-common v0.2.2 Compiling block-buffer v0.12.1 Compiling cpufeatures v0.3.1 Compiling digest v0.11.3 Compiling sha2 v0.11.0 Compiling turkos-kernel v0.0.1 (/kernel) Finished `test` profile [unoptimized + debuginfo] target(s) in 1.61s Running tests/runtime.rs (reports/os-implementation/K641-K659-5qb6G5/mutant-missing-return/target/debug/build/turkos-os-runtime-services/fb7fb8ec67b22a95/out/runtime-fb7fb8ec67b22a95) thread 'success_without_returning_resources_is_rejected' (40797516) panicked at tests/runtime.rs:610:5: assertion `left == right` failed left: Ok(()) right: Err(ResourcesRemain(Scheduler)) note: run with `RUST_BACKTRACE=1` environment variable to display a backtrace error: test failed, to rerun pass `--test runtime`