running 1 test test fifo_uses_issue_sequence_after_slot_reuse ... FAILED failures: ---- fifo_uses_issue_sequence_after_slot_reuse stdout ---- thread 'fifo_uses_issue_sequence_after_slot_reuse' (41615037) panicked at tests/deferred_work.rs:861:5: assertion `left == right` failed left: 3 right: 2 note: run with `RUST_BACKTRACE=1` environment variable to display a backtrace failures: fifo_uses_issue_sequence_after_slot_reuse test result: FAILED. 0 passed; 1 failed; 0 ignored; 0 measured; 27 filtered out; finished in 0.00s Compiling turkos-os-deferred-work v0.1.0 (/reports/os-implementation/K981-K999-preparation-0bsVMr/mutant-newest-before-oldest/os-deferred-work) Finished `test` profile [unoptimized + debuginfo] target(s) in 0.48s Running tests/deferred_work.rs (reports/os-implementation/K981-K999-preparation-0bsVMr/mutant-newest-before-oldest/target/debug/build/turkos-os-deferred-work/bfb4bf5e81b06a44/out/deferred_work-bfb4bf5e81b06a44) error: test failed, to rerun pass `--test deferred_work`