running 1 test test missing_pair_rejected ... FAILED failures: failures: missing_pair_rejected test result: FAILED. 0 passed; 1 failed; 0 ignored; 0 measured; 8 filtered out; finished in 0.00s Compiling turkos-os-boot-regions v0.1.0 (/reports/os-implementation/K611-K614-EzW3BR/mutant-skip-handoff-pair/os-boot-regions) Finished `test` profile [unoptimized + debuginfo] target(s) in 0.20s Running tests/regions.rs (reports/os-implementation/K611-K614-EzW3BR/mutant-skip-handoff-pair/target/debug/build/turkos-os-boot-regions/7b192f17a667f2eb/out/regions-7b192f17a667f2eb) thread 'missing_pair_rejected' (39846205) panicked at tests/regions.rs:60:5: assertion `left == right` failed left: Ok(Plan { entries: [Some(Reservation { owner: Image, pages: Range { start: 1074266112, end: 1074397184 } }), Some(Reservation { owner: ImageGuard, pages: Range { start: 1074397184, end: 1074401280 } }), Some(Reservation { owner: Dtb, pages: Range { start: 1074462720, end: 1074466816 } }), Some(Reservation { owner: LoaderPayload, pages: Range { start: 1074466816, end: 1074470912 } }), None], len: 4 }) right: Err(MissingHandoffPair) note: run with `RUST_BACKTRACE=1` environment variable to display a backtrace error: test failed, to rerun pass `--test regions`