running 1 test test stale_same_thread_intact_capture_is_not_the_current_handoff ... FAILED failures: failures: stale_same_thread_intact_capture_is_not_the_current_handoff test result: FAILED. 0 passed; 1 failed; 0 ignored; 0 measured; 32 filtered out; finished in 0.00s Compiling turkos-os-exceptions v0.1.0 (/reports/os-implementation/K1021-K1039-preparation-EkLAoy/mutant-actual-capture-ignored/os-exceptions) Compiling turkos-os-threads v0.1.0 (/reports/os-implementation/K1021-K1039-preparation-EkLAoy/mutant-actual-capture-ignored/os-threads) Compiling turkos-os-context-switch v0.1.0 (/reports/os-implementation/K1021-K1039-preparation-EkLAoy/mutant-actual-capture-ignored/os-context-switch) Finished `test` profile [unoptimized + debuginfo] target(s) in 0.43s Running tests/context.rs (reports/os-implementation/K1021-K1039-preparation-EkLAoy/mutant-actual-capture-ignored/target/debug/build/turkos-os-context-switch/0bb2a4acbaf04822/out/context-0bb2a4acbaf04822) thread 'stale_same_thread_intact_capture_is_not_the_current_handoff' (41793011) panicked at tests/context.rs:284:5: assertion failed: matches!(bank.cooperate(a, b, old), Err(Error::Capture)) note: run with `RUST_BACKTRACE=1` environment variable to display a backtrace error: test failed, to rerun pass `--test context`