running 1 test test four_level_indices_cover_each_bit_boundary ... FAILED failures: failures: four_level_indices_cover_each_bit_boundary test result: FAILED. 0 passed; 1 failed; 0 ignored; 0 measured; 9 filtered out; finished in 0.00s Compiling turkos-os-runtime-platform v0.1.0 (/os-runtime-platform) Compiling turkos-os-page-tables v0.1.0 (/reports/os-implementation/K801-K819-bFalcS/mutant-wrong-index/os-page-tables) Compiling turkos-os-frame-metadata v0.1.0 (/os-frame-metadata) Compiling turkos-os-frame-authority v0.1.0 (/os-frame-authority) Finished `test` profile [unoptimized + debuginfo] target(s) in 0.41s Running tests/descriptor.rs (reports/os-implementation/K801-K819-bFalcS/mutant-wrong-index/target/debug/build/turkos-os-page-tables/b64cd06aa99d6d91/out/descriptor-b64cd06aa99d6d91) thread 'four_level_indices_cover_each_bit_boundary' (41100572) panicked at tests/descriptor.rs:43:9: assertion `left == right` failed left: Ok(255) right: Ok(511) note: run with `RUST_BACKTRACE=1` environment variable to display a backtrace error: test failed, to rerun pass `--test descriptor`