running 1 test test foreign_and_consumed_entry_tokens_never_unwind_another_frame ... FAILED failures: ---- foreign_and_consumed_entry_tokens_never_unwind_another_frame stdout ---- thread 'foreign_and_consumed_entry_tokens_never_unwind_another_frame' (41254100) panicked at tests/exceptions.rs:502:5: assertion `left == right` failed left: Ok(()) right: Err(Foreign) note: run with `RUST_BACKTRACE=1` environment variable to display a backtrace failures: foreign_and_consumed_entry_tokens_never_unwind_another_frame test result: FAILED. 0 passed; 1 failed; 0 ignored; 0 measured; 22 filtered out; finished in 0.00s Compiling turkos-os-exceptions v0.1.0 (/reports/os-implementation/K901-K919-preparation-EQ5mcc/mutant-foreign-token/os-exceptions) Finished `test` profile [unoptimized + debuginfo] target(s) in 0.26s Running tests/exceptions.rs (reports/os-implementation/K901-K919-preparation-EQ5mcc/mutant-foreign-token/target/debug/build/turkos-os-exceptions/75414a6222e92fd7/out/exceptions-75414a6222e92fd7) error: test failed, to rerun pass `--test exceptions`