running 1 test test actual_width_uses_mmfr0_and_tcr_separately ... FAILED failures: ---- actual_width_uses_mmfr0_and_tcr_separately stdout ---- thread 'actual_width_uses_mmfr0_and_tcr_separately' (41108410) panicked at tests/spaces.rs:103:5: assertion `left == right` failed left: Ok(Configuration { hardware_bits: 8, active_bits: 16 }) right: Err(Configuration) note: run with `RUST_BACKTRACE=1` environment variable to display a backtrace failures: actual_width_uses_mmfr0_and_tcr_separately test result: FAILED. 0 passed; 1 failed; 0 ignored; 0 measured; 17 filtered out; finished in 0.00s Compiling turkos-os-address-spaces v0.1.0 (/reports/os-implementation/K821-K839-preparation-6JTwAT/mutant-fake-width/os-address-spaces) Finished `test` profile [unoptimized + debuginfo] target(s) in 0.29s Running tests/spaces.rs (reports/os-implementation/K821-K839-preparation-6JTwAT/mutant-fake-width/target/debug/build/turkos-os-address-spaces/8a8b018c19f35bf8/out/spaces-8a8b018c19f35bf8) error: test failed, to rerun pass `--test spaces`