running 1 test test os_gic_routing_negative ... FAILED failures: failures: os_gic_routing_negative test result: FAILED. 0 passed; 1 failed; 0 ignored; 0 measured; 25 filtered out; finished in 0.00s Compiling turkos-os-gic v0.1.0 (/reports/os-implementation/K921-K939-preparation-7Bk1ve/mutant-duplicate-intid/os-gic) Finished `test` profile [unoptimized + debuginfo] target(s) in 0.38s Running tests/gic.rs (reports/os-implementation/K921-K939-preparation-7Bk1ve/mutant-duplicate-intid/target/debug/build/turkos-os-gic/504a3f6ce8f6a297/out/gic-504a3f6ce8f6a297) thread 'os_gic_routing_negative' (41336689) panicked at tests/gic.rs:207:50: called `Result::unwrap_err()` on an `Ok` value: Registration { instance: 1, slot: 1, generation: 1, owner: 200, intid: 30, cpu: 0 } note: run with `RUST_BACKTRACE=1` environment variable to display a backtrace error: test failed, to rerun pass `--test gic`