running 1 test test active_candidate_stack_is_never_zeroed ... FAILED failures: failures: active_candidate_stack_is_never_zeroed test result: FAILED. 0 passed; 1 failed; 0 ignored; 0 measured; 21 filtered out; finished in 0.00s Compiling turkos-os-threads v0.1.0 (/reports/os-implementation/K1001-K1019-preparation-Vy7GRN/mutant-active-candidate-zeroed/os-threads) warning: unused variable: `context` --> src/threads.rs:323:13 | 323 | let context = match self.context() { | ^^^^^^^ help: if this is intentional, prefix it with an underscore: `_context` | = note: `#[warn(unused_variables)]` (part of `#[warn(unused)]`) on by default warning: `turkos-os-threads` (lib) generated 1 warning (run `cargo fix --lib -p turkos-os-threads` to apply 1 suggestion) Finished `test` profile [unoptimized + debuginfo] target(s) in 0.28s Running tests/threads.rs (reports/os-implementation/K1001-K1019-preparation-Vy7GRN/mutant-active-candidate-zeroed/target/debug/build/turkos-os-threads/fc0d96e38d2f6d6f/out/threads-fc0d96e38d2f6d6f) thread 'active_candidate_stack_is_never_zeroed' (41558680) panicked at tests/threads.rs:384:69: called `Result::unwrap_err()` on an `Ok` value: ThreadId { table: 1, slot: 0, generation: 1 } note: run with `RUST_BACKTRACE=1` environment variable to display a backtrace error: test failed, to rerun pass `--test threads`