running 1 test test mutex::exhaustion_tests::stale_wait_generation_never_claims_a_reused_slot ... FAILED failures: failures: mutex::exhaustion_tests::stale_wait_generation_never_claims_a_reused_slot test result: FAILED. 0 passed; 1 failed; 0 ignored; 0 measured; 5 filtered out; finished in 0.00s Compiling turkos-os-locking v0.1.0 (/reports/os-implementation/K961-K979-preparation-HHDGYT/mutant-mutex-stale-wait-generation/os-locking) Finished `test` profile [unoptimized + debuginfo] target(s) in 0.21s Running unittests src/lib.rs (reports/os-implementation/K961-K979-preparation-HHDGYT/mutant-mutex-stale-wait-generation/target/debug/build/turkos-os-locking/5813bd7aeb4d174b/out/turkos_os_locking-5813bd7aeb4d174b) thread 'mutex::exhaustion_tests::stale_wait_generation_never_claims_a_reused_slot' (41477999) panicked at src/mutex.rs:557:9: assertion `left == right` failed left: Busy right: Stale note: run with `RUST_BACKTRACE=1` environment variable to display a backtrace error: test failed, to rerun pass `--lib`