running 1 test test runqueue::exhaustion_tests::private_foreign_generation_and_stale_slot_refuse_complete_inventory ... FAILED failures: failures: runqueue::exhaustion_tests::private_foreign_generation_and_stale_slot_refuse_complete_inventory test result: FAILED. 0 passed; 1 failed; 0 ignored; 0 measured; 5 filtered out; finished in 0.00s Compiling turkos-os-exceptions v0.1.0 (/reports/os-implementation/K1041-K1059-preparation-5hOulI/mutant-stale-generation/os-exceptions) Compiling turkos-os-threads v0.1.0 (/reports/os-implementation/K1041-K1059-preparation-5hOulI/mutant-stale-generation/os-threads) Compiling turkos-os-context-switch v0.1.0 (/reports/os-implementation/K1041-K1059-preparation-5hOulI/mutant-stale-generation/os-context-switch) Compiling turkos-os-runqueue v0.1.0 (/reports/os-implementation/K1041-K1059-preparation-5hOulI/mutant-stale-generation/os-runqueue) Finished `test` profile [unoptimized + debuginfo] target(s) in 0.61s Running unittests src/lib.rs (reports/os-implementation/K1041-K1059-preparation-5hOulI/mutant-stale-generation/target/debug/build/turkos-os-runqueue/2cbb43b0aa687e17/out/turkos_os_runqueue-2cbb43b0aa687e17) thread 'runqueue::exhaustion_tests::private_foreign_generation_and_stale_slot_refuse_complete_inventory' (41914572) panicked at src/runqueue.rs:842:9: assertion `left == right` failed left: Ok(()) right: Err(Stale) note: run with `RUST_BACKTRACE=1` environment variable to display a backtrace error: test failed, to rerun pass `--lib`