running 1 test test os_diagnostics_fault_negative ... FAILED failures: failures: os_diagnostics_fault_negative test result: FAILED. 0 passed; 1 failed; 0 ignored; 0 measured; 16 filtered out; finished in 0.00s Compiling turkos-os-runtime-diagnostics v0.1.0 (/reports/os-implementation/K661-K679-llspFW/mutant-invalid-far/os-runtime-diagnostics) Finished `test` profile [unoptimized + debuginfo] target(s) in 0.27s Running tests/diagnostics.rs (reports/os-implementation/K661-K679-llspFW/mutant-invalid-far/target/debug/build/turkos-os-runtime-diagnostics/1389b3a65c1f13ac/out/diagnostics-1389b3a65c1f13ac) thread 'os_diagnostics_fault_negative' (40820044) panicked at tests/diagnostics.rs:266:5: assertion `left == right` failed left: Ok(FaultReport { context: Kernel, slot: 4, esr: 4026531840, elr: PublicAddress { kind: KernelVirtual, value: 1074270208 }, far: Some(PublicAddress { kind: KernelVirtual, value: 5419580981793604434 }) }) right: Err(InvalidFar) note: run with `RUST_BACKTRACE=1` environment variable to display a backtrace error: test failed, to rerun pass `--test diagnostics`