running 2 tests test os_vfs_paths_lookup_positive ... ok test os_vfs_paths_lookup_negative ... FAILED failures: ---- os_vfs_paths_lookup_negative stdout ---- thread 'os_vfs_paths_lookup_negative' (49930417) panicked at /reports/os-implementation/K1555-vfs-lookup-local-M5F1t5/mutant/kernel/tests/os/vfs_lookup.rs:38:5: assertion `left == right` failed left: Ok(11) right: Err(Stale) note: run with `RUST_BACKTRACE=1` environment variable to display a backtrace failures: os_vfs_paths_lookup_negative test result: FAILED. 1 passed; 1 failed; 0 ignored; 0 measured; 0 filtered out; finished in 0.00s