running 1 test test current_el_irq_has_separate_kernel_return_authority ... FAILED failures: ---- current_el_irq_has_separate_kernel_return_authority stdout ---- thread 'current_el_irq_has_separate_kernel_return_authority' (41253339) panicked at tests/exceptions.rs:415:9: assertion `left == right` failed left: Err(Status) right: Err(WrongOrigin) note: run with `RUST_BACKTRACE=1` environment variable to display a backtrace failures: current_el_irq_has_separate_kernel_return_authority test result: FAILED. 0 passed; 1 failed; 0 ignored; 0 measured; 22 filtered out; finished in 0.00s Compiling turkos-os-exceptions v0.1.0 (/reports/os-implementation/K901-K919-preparation-EQ5mcc/mutant-wrong-kernel-return-slot/os-exceptions) warning: unused variable: `vector` --> src/exceptions.rs:357:9 | 357 | let vector = validate_ingress(frame, address, kernel_stack)?; | ^^^^^^ help: if this is intentional, prefix it with an underscore: `_vector` | = note: `#[warn(unused_variables)]` (part of `#[warn(unused)]`) on by default warning: `turkos-os-exceptions` (lib) generated 1 warning (run `cargo fix --lib -p turkos-os-exceptions` to apply 1 suggestion) Finished `test` profile [unoptimized + debuginfo] target(s) in 0.26s Running tests/exceptions.rs (reports/os-implementation/K901-K919-preparation-EQ5mcc/mutant-wrong-kernel-return-slot/target/debug/build/turkos-os-exceptions/75414a6222e92fd7/out/exceptions-75414a6222e92fd7) error: test failed, to rerun pass `--test exceptions`