running 1 test test os_frame_metadata_zero_negative ... FAILED failures: ---- os_frame_metadata_zero_negative stdout ---- thread 'os_frame_metadata_zero_negative' (40830504) panicked at tests/metadata.rs:123:5: assertion `left == right` failed left: Ok(Handle { registry: 1, owner: 17, address: 1073741824, slot: 0, generation: 1 }) right: Err(Erasure) note: run with `RUST_BACKTRACE=1` environment variable to display a backtrace failures: os_frame_metadata_zero_negative test result: FAILED. 0 passed; 1 failed; 0 ignored; 0 measured; 13 filtered out; finished in 0.00s Compiling turkos-os-frame-metadata v0.1.0 (/reports/os-implementation/K721-K739-preparation-TFuAQv/mutant-partial-erasure/os-frame-metadata) Finished `test` profile [unoptimized + debuginfo] target(s) in 0.24s Running tests/metadata.rs (reports/os-implementation/K721-K739-preparation-TFuAQv/mutant-partial-erasure/target/debug/build/turkos-os-frame-metadata/55cb84e7a70a83e7/out/metadata-55cb84e7a70a83e7) error: test failed, to rerun pass `--test metadata`