running 2 tests test os_virtio_mmio_v2_positive ... ok test os_virtio_mmio_v2_negative ... FAILED failures: ---- os_virtio_mmio_v2_negative stdout ---- thread 'os_virtio_mmio_v2_negative' (49288307) panicked at /reports/os-implementation/K1465-virtio-mmio-v2-local-kSyvs9/mutant/kernel/tests/os/virtio_mmio_v2.rs:62:5: assertion `left == right` failed left: Ok(()) right: Err(StillReady) note: run with `RUST_BACKTRACE=1` environment variable to display a backtrace failures: os_virtio_mmio_v2_negative test result: FAILED. 1 passed; 1 failed; 0 ignored; 0 measured; 0 filtered out; finished in 0.00s