running 1 test test malformed_layout_and_non_executable_entry_refuse_before_stack_writes ... FAILED failures: failures: malformed_layout_and_non_executable_entry_refuse_before_stack_writes test result: FAILED. 0 passed; 1 failed; 0 ignored; 0 measured; 21 filtered out; finished in 0.00s Compiling turkos-os-threads v0.1.0 (/reports/os-implementation/K1001-K1019-preparation-Vy7GRN/mutant-too-small-stack/os-threads) Finished `test` profile [unoptimized + debuginfo] target(s) in 0.28s Running tests/threads.rs (reports/os-implementation/K1001-K1019-preparation-Vy7GRN/mutant-too-small-stack/target/debug/build/turkos-os-threads/fc0d96e38d2f6d6f/out/threads-fc0d96e38d2f6d6f) thread 'malformed_layout_and_non_executable_entry_refuse_before_stack_writes' (41561623) panicked at tests/threads.rs:367:48: called `Result::unwrap_err()` on an `Ok` value: ThreadId { table: 1, slot: 0, generation: 1 } note: run with `RUST_BACKTRACE=1` environment variable to display a backtrace error: test failed, to rerun pass `--test threads`